{"text_format":"1","workbook":"xlsx","n_sheets":8,"sheets":["Tarifierung","Tarifgruppen","Tarifgruppe S","Tarif URP","Werte","Mapping für KRisk","Maklertarif","V-Tarif"],"not_rendered":{"charts":0,"images":0,"macros":1,"external_links":2,"defined_names":295,"comments":0,"pivot_tables":0},"unopened":[],"bounds":{"document_bytes":16777216,"sheet_cells":100000,"rows_first":2000,"rows_last":500,"rows_between":2000,"halvings":0,"cell_chars":16384,"cell_head_chars":4096},"cells_cut":0,"cells_raw":0,"read":"whole","date_system":"1900"}

{"sheet":"Tarifierung","index":0,"n_rows":32,"n_cols":19,"rows_kept":32,"cut":false,"hidden":false,"merged":[]}
["V-Jahr",2080,2018,51,null,null,"VP2",null,5,null,null,"VP3",null,1,null,null,"VP4",null,1]
["Dynamik",0.05,"V-Beginn","Alter Vbeginn",null,null,null,null,"Alter Vbeginn",null,null,null,null,"Alter Vbeginn",null,null,null,null,"Alter Vbeginn"]
["Raucher","nein",null,null,null,"Raucher","nein",null,null,null,"Raucher","nein",null,null,null,"Raucher","nein"]
["Risikozuschlag URP",0,null,null,null,"Risikozuschlag URP",0,null,null,null,"Risikozuschlag URP",0,null,null,null,"Risikozuschlag URP",0]
["Alter zum V-Beginn",{"$f":"VJahr-(C1-D1)","v":113},null,null,null,"Alter zum V-Beginn",{"$f":"VJahr-(C1-I1)","v":67},null,null,null,"Alter zum V-Beginn",{"$f":"VJahr-(C1-N1)","v":63},null,null,null,"Alter zum V-Beginn",{"$f":"VJahr-(C1-S1)","v":63}]
["Gefahrengruppe","S",null,null,null,"Gefahrengruppe","S",null,null,null,"Gefahrengruppe","A",null,null,null,"Gefahrengruppe","A"]
["Integralfranchise","nein","BS","Nettobeitrag",null,"Integralfranchise","nein","BS","Nettobeitrag",null,"nein","nein","BS","Nettobeitrag",null,"Integralfranchise","nein","BS","Nettobeitrag"]
["Invalidität 600",335000,13.01,{"$f":"(B8/1000)*C8","v":4358.3500000000004},null,"Invalidität 350",575000,1.1200000000000001,{"$f":"(G8/1000)*H8","v":644.00000000000011},null,"Invalidität",0,0,{"$f":"(L8/1000)*M8","v":0},null,"Invalidität",0,0,{"$f":"(Q8/1000)*R8","v":0}]
["verb. GT Ärzte",0,0,{"$f":"(B9/1000)*C9","v":0},null,"verb. GT Ärzte",0,0,{"$f":"(G9/1000)*H9","v":0},null,"verb. GT Ärzte",0,0,{"$f":"(L9/1000)*M9","v":0},null,"verb. GT Ärzte",0,0,{"$f":"(Q9/1000)*R9","v":0}]
["Todesfallsumme",474000,5.89,{"$f":"(B10/1000)*C10","v":2791.8599999999997},null,"Todesfallsumme",607000,0.62,{"$f":"(G10/1000)*H10","v":376.34},null,"Todesfallsumme",0,0,{"$f":"(L10/1000)*M10","v":0},null,"Todesfallsumme",0,0,{"$f":"(Q10/1000)*R10","v":0}]
["UKTG",200,3.95,{"$f":"B11*C11","v":790},null,"UKTG",200,0.42,{"$f":"G11*H11","v":84},null,"UKTG",0,0,{"$f":"L11*M11","v":0},null,"UKTG",0,0,{"$f":"Q11*R11","v":0}]
["Genesungsgeld",0,0,{"$f":"B12*C12","v":0},null,"Genesungsgeld",0,0,{"$f":"G12*H12","v":0},null,"Genesungsgeld",0,0,{"$f":"L12*M12","v":0},null,"Genesungsgeld",0,0,{"$f":"Q12*R12","v":0}]
["TG ab 8. Tag",0,0,{"$f":"C13*B13","v":0},null,"TG ab 8. Tag",0,0,{"$f":"H13*G13","v":0},null,"TG ab 8. Tag",0,0,{"$f":"M13*L13","v":0},null,"TG ab 8. Tag",0,0,{"$f":"R13*Q13","v":0}]
["Tagegeld spezial",0,0,{"$f":"C14*B14","v":0},null,"Tagegeld spezial",0,0,{"$f":"H14*G14","v":0},null,"Tagegeld spezial",0,0,{"$f":"M14*L14","v":0},null,"Tagegeld spezial",0,0,{"$f":"R14*Q14","v":0}]
["KOP",50000,0,{"$f":"IF(B22=\"Basis\",((B15-15000)/5000)*C15,(IF(B22=\"Plus\",((B15-25000)/5000)*C15,((B15-50000)/5000)*C15)))","v":0},null,"KOP",25000,6.7,{"$f":"IF(G22=\"Basis\",((G15-15000)/5000)*H15,(IF(G22=\"Plus\",((G15-25000)/5000)*H15,((G15-50000)/5000)*H15)))","v":0},null,"KOP",15000,6.7,{"$f":"IF(L22=\"Basis\",((L15-15000)/5000)*M15,(IF(L22=\"Plus\",((L15-25000)/5000)*M15,((L15-50000)/5000)*M15)))","v":0},null,"KOP",15000,6.7,{"$f":"IF(Q22=\"Basis\",((Q15-15000)/5000)*R15,(IF(Q22=\"Plus\",((Q15-25000)/5000)*R15,((Q15-50000)/5000)*R15)))","v":0}]
{"$rows_left_out":18}
{"sheet":"Tarifgruppen","index":1,"n_rows":22,"n_cols":10,"rows_kept":22,"cut":false,"hidden":true,"merged":[]}
["Spalte 1","Spalte 2","Spalte 3","Spalte 4","Spalte 5","Spalte 6","Spalte 7","Spalte 8","Spalte 9","Spalte 10"]
[null,"Leistungsarten Erwachsene Kinder",null,"A","B1","B2","B3","B4","K","S"]
["Progression","ohne","je 1.000 ",0.66,0.93,1,1.2,1.46,0.32,"siehe Tarifgruppe S"]
["Progression",3.5,"je 1.000 ",0.93,1.34,1.44,1.73,2.11,0.42,"siehe Tarifgruppe S"]
["Progression",6,"je 1.000 ",1.1499999999999999,1.67,1.79,2.15,2.63,0.47,"siehe Tarifgruppe S"]
[null,"mit verbesserter Gliedertaxe für Ärzte UIVGT","je 1.000 ",1.36,0,0,0,0,0,"-"]
[null,"mit verbesserter Gliedertaxe für Ärzte mit UIVGP 350%","je 1.000 ",2.92,0,0,0,0,0,"-"]
[null,"Invaliditätsrente 0 – 59 Jahre UIR 65","je 10 ",0.44,0.82,0.86,0.91,1.1000000000000001,0.31,"-"]
[null,"Invaliditätsrente 0 – 59 Jahre UIR (ein Leben lang)","je 10 ",0.79,1.29,1.37,1.44,1.75,0.36]
[null,null,null,0,0,0,0,0,0]
[null,"Tod UT","je 1.000 ",0.52,0.66,0.66,0.66,0.66,0.34,0.34]
[null,"Unfallkrankenhaustagegeld UKT","je 1",0.35,0.46,0.46,0.46,0.46,0.21,0.21]
[null,"Genesungsgeld GG ","je 1",0.34,0.45,0.45,0.45,0.45,0.2,0.2]
["Tagegeld","ab 8. Tag","je 1",4.46,6.94,6.94,6.94,6.94,0,"-"]
["Tagegeld","ab 15. Tag","je 1",4.07,5.16,5.16,5.16,5.16,0,"-"]
{"$rows_left_out":8}
{"sheet":"Tarifgruppe S","index":2,"n_rows":75,"n_cols":15,"rows_kept":75,"cut":false,"hidden":true,"merged":[[11,1,11,7],[11,8,11,14]]}
["Mappingzeile für Makro \"BS_Invalidität\""]
["Spalte 1","Spalte 2","Spalte 3","Spalte 4","Spalte 5","Spalte 6","Spalte 7","Spalte 8","Spalte 9","Spalte 10","Spalte 11","Spalte 12","Spalte 13","Spalte 14","Spalte 15"]
["VP1",{"$f":"ROUND(VLOOKUP(Tarifierung!$B$5,$A$13:$O$75,2,FALSE),2)","v":7.49},{"$f":"ROUND(VLOOKUP(Tarifierung!$B$5,$A$13:$O$75,3,FALSE),2)","v":10.54},{"$f":"ROUND(VLOOKUP(Tarifierung!$B$5,$A$13:$O$75,4,FALSE),2)","v":13.01},{"$f":"ROUND(VLOOKUP(Tarifierung!$B$5,$A$13:$O$75,5,FALSE),2)","v":5.89},{"$f":"ROUND(VLOOKUP(Tarifierung!$B$5,$A$13:$O$75,6,FALSE),2)","v":3.95},{"$f":"ROUND(VLOOKUP(Tarifierung!$B$5,$A$13:$O$75,7,FALSE),2)","v":3.85},{"$f":"ROUND(VLOOKUP(Tarifierung!$B$5,$A$13:$O$75,8,FALSE),2)","v":46.08},{"$f":"ROUND(VLOOKUP(Tarifierung!$B$5,$A$13:$O$75,9,FALSE),2)","v":6.24},{"$f":"ROUND(VLOOKUP(Tarifierung!$B$5,$A$13:$O$75,10,FALSE),2)","v":8.7799999999999994},{"$f":"ROUND(VLOOKUP(Tarifierung!$B$5,$A$13:$O$75,11,FALSE),2)","v":10.84},{"$f":"ROUND(VLOOKUP(Tarifierung!$B$5,$A$13:$O$75,12,FALSE),2)","v":4.91},{"$f":"ROUND(VLOOKUP(Tarifierung!$B$5,$A$13:$O$75,13,FALSE),2)","v":3.29},{"$f":"ROUND(VLOOKUP(Tarifierung!$B$5,$A$13:$O$75,14,FALSE),2)","v":3.21},{"$f":"ROUND(VLOOKUP(Tarifierung!$B$5,$A$13:$O$75,15,FALSE),2)","v":38.4}]
["VP2",{"$f":"ROUND(VLOOKUP(Tarifierung!$G$5,$A$13:$O$75,2,FALSE),2)","v":0.79},{"$f":"ROUND(VLOOKUP(Tarifierung!$G$5,$A$13:$O$75,3,FALSE),2)","v":1.1200000000000001},{"$f":"ROUND(VLOOKUP(Tarifierung!$G$5,$A$13:$O$75,4,FALSE),2)","v":1.38},{"$f":"ROUND(VLOOKUP(Tarifierung!$G$5,$A$13:$O$75,5,FALSE),2)","v":0.62},{"$f":"ROUND(VLOOKUP(Tarifierung!$G$5,$A$13:$O$75,6,FALSE),2)","v":0.42},{"$f":"ROUND(VLOOKUP(Tarifierung!$G$5,$A$13:$O$75,7,FALSE),2)","v":0.41},{"$f":"ROUND(VLOOKUP(Tarifierung!$G$5,$A$13:$O$75,8,FALSE),2)","v":4.88},{"$f":"ROUND(VLOOKUP(Tarifierung!$G$5,$A$13:$O$75,9,FALSE),2)","v":0.66},{"$f":"ROUND(VLOOKUP(Tarifierung!$G$5,$A$13:$O$75,10,FALSE),2)","v":0.93},{"$f":"ROUND(VLOOKUP(Tarifierung!$G$5,$A$13:$O$75,11,FALSE),2)","v":1.1499999999999999},{"$f":"ROUND(VLOOKUP(Tarifierung!$G$5,$A$13:$O$75,12,FALSE),2)","v":0.52},{"$f":"ROUND(VLOOKUP(Tarifierung!$G$5,$A$13:$O$75,13,FALSE),2)","v":0.35},{"$f":"ROUND(VLOOKUP(Tarifierung!$G$5,$A$13:$O$75,14,FALSE),2)","v":0.34},{"$f":"ROUND(VLOOKUP(Tarifierung!$G$5,$A$13:$O$75,15,FALSE),2)","v":4.07}]
["VP3",{"$f":"ROUND(VLOOKUP(Tarifierung!$L$5,$A$13:$O$75,2,FALSE),2)","v":{"$error":"#N/A"}},{"$f":"ROUND(VLOOKUP(Tarifierung!$L$5,$A$13:$O$75,3,FALSE),2)","v":{"$error":"#N/A"}},{"$f":"ROUND(VLOOKUP(Tarifierung!$L$5,$A$13:$O$75,4,FALSE),2)","v":{"$error":"#N/A"}},{"$f":"ROUND(VLOOKUP(Tarifierung!$L$5,$A$13:$O$75,5,FALSE),2)","v":{"$error":"#N/A"}},{"$f":"ROUND(VLOOKUP(Tarifierung!$L$5,$A$13:$O$75,6,FALSE),2)","v":{"$error":"#N/A"}},{"$f":"ROUND(VLOOKUP(Tarifierung!$L$5,$A$13:$O$75,7,FALSE),2)","v":{"$error":"#N/A"}},{"$f":"ROUND(VLOOKUP(Tarifierung!$L$5,$A$13:$O$75,8,FALSE),2)","v":{"$error":"#N/A"}},{"$f":"ROUND(VLOOKUP(Tarifierung!$L$5,$A$13:$O$75,9,FALSE),2)","v":{"$error":"#N/A"}},{"$f":"ROUND(VLOOKUP(Tarifierung!$L$5,$A$13:$O$75,10,FALSE),2)","v":{"$error":"#N/A"}},{"$f":"ROUND(VLOOKUP(Tarifierung!$L$5,$A$13:$O$75,11,FALSE),2)","v":{"$error":"#N/A"}},{"$f":"ROUND(VLOOKUP(Tarifierung!$L$5,$A$13:$O$75,12,FALSE),2)","v":{"$error":"#N/A"}},{"$f":"ROUND(VLOOKUP(Tarifierung!$L$5,$A$13:$O$75,13,FALSE),2)","v":{"$error":"#N/A"}},{"$f":"ROUND(VLOOKUP(Tarifierung!$L$5,$A$13:$O$75,14,FALSE),2)","v":{"$error":"#N/A"}},{"$f":"ROUND(VLOOKUP(Tarifierung!$L$5,$A$13:$O$75,15,FALSE),2)","v":{"$error":"#N/A"}}]
["VP4",{"$f":"ROUND(VLOOKUP(Tarifierung!$Q$5,$A$13:$O$75,2,FALSE),2)","v":{"$error":"#N/A"}},{"$f":"ROUND(VLOOKUP(Tarifierung!$Q$5,$A$13:$O$75,3,FALSE),2)","v":{"$error":"#N/A"}},{"$f":"ROUND(VLOOKUP(Tarifierung!$Q$5,$A$13:$O$75,4,FALSE),2)","v":{"$error":"#N/A"}},{"$f":"ROUND(VLOOKUP(Tarifierung!$Q$5,$A$13:$O$75,5,FALSE),2)","v":{"$error":"#N/A"}},{"$f":"ROUND(VLOOKUP(Tarifierung!$Q$5,$A$13:$O$75,6,FALSE),2)","v":{"$error":"#N/A"}},{"$f":"ROUND(VLOOKUP(Tarifierung!$Q$5,$A$13:$O$75,7,FALSE),2)","v":{"$error":"#N/A"}},{"$f":"ROUND(VLOOKUP(Tarifierung!$Q$5,$A$13:$O$75,8,FALSE),2)","v":{"$error":"#N/A"}},{"$f":"ROUND(VLOOKUP(Tarifierung!$Q$5,$A$13:$O$75,9,FALSE),2)","v":{"$error":"#N/A"}},{"$f":"ROUND(VLOOKUP(Tarifierung!$Q$5,$A$13:$O$75,10,FALSE),2)","v":{"$error":"#N/A"}},{"$f":"ROUND(VLOOKUP(Tarifierung!$Q$5,$A$13:$O$75,11,FALSE),2)","v":{"$error":"#N/A"}},{"$f":"ROUND(VLOOKUP(Tarifierung!$Q$5,$A$13:$O$75,12,FALSE),2)","v":{"$error":"#N/A"}},{"$f":"ROUND(VLOOKUP(Tarifierung!$Q$5,$A$13:$O$75,13,FALSE),2)","v":{"$error":"#N/A"}},{"$f":"ROUND(VLOOKUP(Tarifierung!$Q$5,$A$13:$O$75,14,FALSE),2)","v":{"$error":"#N/A"}},{"$f":"ROUND(VLOOKUP(Tarifierung!$Q$5,$A$13:$O$75,15,FALSE),2)","v":{"$error":"#N/A"}}]
[]
[]
[]
["Unfallkalkulation: Senioren"]
[]
[null,"ohne Integralfranchise",null,null,null,null,null,null,"mit Integralfranchise"]
["Alter","ohne Progression","350 Progression","600 Progression","Unfalltod","KHTG","GG","TG spez","ohne Progression","350 Progression","600 Progression","Unfalltod","KHTG","GG","TG spez"]
["Basis"]
[]
{"$rows_left_out":61}
{"sheet":"Tarif URP","index":3,"n_rows":75,"n_cols":7,"rows_kept":75,"cut":false,"hidden":true,"merged":[[7,1,7,2],[7,3,7,4],[7,5,7,6]]}
["Beitragssätze aus Datei \"Beiträge_Unfallrente_Plus_Stand_130930_send.xls\""]
["VP1",{"$f":"VLOOKUP(Tarifierung!$B$5,$A$9:$G$75,2,FALSE)","v":{"$error":"#N/A"}},{"$f":"VLOOKUP(Tarifierung!$B$5,$A$9:$G$75,3,FALSE)","v":{"$error":"#N/A"}},{"$f":"VLOOKUP(Tarifierung!$B$5,$A$9:$G$75,4,FALSE)","v":{"$error":"#N/A"}},{"$f":"VLOOKUP(Tarifierung!$B$5,$A$9:$G$75,5,FALSE)","v":{"$error":"#N/A"}},{"$f":"VLOOKUP(Tarifierung!$B$5,$A$9:$G$75,6,FALSE)","v":{"$error":"#N/A"}},{"$f":"VLOOKUP(Tarifierung!$B$5,$A$9:$G$75,7,FALSE)","v":{"$error":"#N/A"}}]
["VP2",{"$f":"VLOOKUP(Tarifierung!$G$5,$A$9:$G$75,2,FALSE)","v":{"$error":"#N/A"}},{"$f":"VLOOKUP(Tarifierung!$G$5,$A$9:$G$75,3,FALSE)","v":{"$error":"#N/A"}},{"$f":"VLOOKUP(Tarifierung!$G$5,$A$9:$G$75,4,FALSE)","v":{"$error":"#N/A"}},{"$f":"VLOOKUP(Tarifierung!$G$5,$A$9:$G$75,5,FALSE)","v":{"$error":"#N/A"}},{"$f":"VLOOKUP(Tarifierung!$G$5,$A$9:$G$75,6,FALSE)","v":{"$error":"#N/A"}},{"$f":"VLOOKUP(Tarifierung!$G$5,$A$9:$G$75,7,FALSE)","v":{"$error":"#N/A"}}]
["VP3",{"$f":"VLOOKUP(Tarifierung!$L$5,$A$9:$G$75,2,FALSE)","v":0},{"$f":"VLOOKUP(Tarifierung!$L$5,$A$9:$G$75,3,FALSE)","v":0},{"$f":"VLOOKUP(Tarifierung!$L$5,$A$9:$G$75,4,FALSE)","v":19.13},{"$f":"VLOOKUP(Tarifierung!$L$5,$A$9:$G$75,5,FALSE)","v":20.92},{"$f":"VLOOKUP(Tarifierung!$L$5,$A$9:$G$75,6,FALSE)","v":8.52},{"$f":"VLOOKUP(Tarifierung!$L$5,$A$9:$G$75,7,FALSE)","v":8.52}]
["VP4",{"$f":"VLOOKUP(Tarifierung!$Q$5,$A$9:$G$75,2,FALSE)","v":0},{"$f":"VLOOKUP(Tarifierung!$Q$5,$A$9:$G$75,3,FALSE)","v":0},{"$f":"VLOOKUP(Tarifierung!$Q$5,$A$9:$G$75,4,FALSE)","v":19.13},{"$f":"VLOOKUP(Tarifierung!$Q$5,$A$9:$G$75,5,FALSE)","v":20.92},{"$f":"VLOOKUP(Tarifierung!$Q$5,$A$9:$G$75,6,FALSE)","v":8.52},{"$f":"VLOOKUP(Tarifierung!$Q$5,$A$9:$G$75,7,FALSE)","v":8.52}]
[]
[]
[null,"URP 60",null,"URP lebenslang",null,"URP 67 K"]
["Alter","ohne Passivdynamik","mit Passivdynamik","ohne Passivdynamik","mit Passivdynamik","ohne Passivdynamik","mit Passivdynamik"]
[1,1.07,1.45,1.24,1.84,1.2,1.76]
[2,1.07,1.45,1.24,1.84,1.2,1.76]
[3,1.07,1.45,1.24,1.84,1.2,1.76]
[4,1.07,1.45,1.24,1.84,1.2,1.76]
[5,1.07,1.45,1.24,1.84,1.2,1.76]
[6,1.07,1.45,1.24,1.84,1.2,1.76]
{"$rows_left_out":61}
{"sheet":"Werte","index":4,"n_rows":349,"n_cols":16,"rows_kept":349,"cut":false,"hidden":true,"merged":[]}
[]
[]
[]
["Progression","nein",3.5,6]
["Gliedertaxe Ärzte","nein","ohne Progression","350 Progression"]
["Tagegeld","TG ab 8. Tag","TG ab 15. Tag","TG ab 29. Tag","TG ab 43. Tag"]
["Tagegeld spezial"]
["KOP",15000,20000,25000,30000,35000,40000,45000,50000,55000,60000]
["Bergungskosten",15000,20000,25000,30000,35000,40000,45000,50000,55000,60000]
["Invaliditätsrente"]
["Kinder-Rente",100,200,300,400,500,600,700,800,900,1000,1100,1200,1300,1400,1500]
["UnfallRente Plus"]
["Deckungsumfang","Basis","Plus","Premium"]
["Raucherzuschlag",0.2]
[]
{"$rows_left_out":335}
{"sheet":"Mapping für KRisk","index":5,"n_rows":2,"n_cols":43,"rows_kept":2,"cut":false,"hidden":true,"merged":[]}
["Alter","Gefahrengruppe","Integralfranchise","Progression","UI/UIP Vsu","BS UI/UIP","UIVGT/UIVGP","UIVGT/UIVGP Vsu","BS UIVGT","UT-Summe","BS UT","UKTG","BS UKTG","GG","BS GG","TG ab","TG Vsu","BS Tagegeld","TG spez","BS TG spez","KOP","BS KOP","BK","BS BK","UIR/UIR 67","UIR Vsu","BS UIR/UIR 67","URP","URP Vsu","BS URP","Kindermodul","Beitrag Kindermodul","Körpermodul","CuraPlus","BS CuraPlus","Produktlinie","Zuschlag Produktlinie","SHU-Quote","Laufzeit","jährlich","halbjährlich","vierteljährlich","monatlich"]
[{"$f":"Tarifierung!B5","v":113},{"$f":"VP1_Gruppe","v":"S"},{"$f":"Tarifierung!B7","v":"nein"},{"$f":"VP1_UI","v":"Invalidität 600"},{"$f":"Tarifierung!B8","v":335000},{"$f":"Tarifierung!C8","v":13.01},{"$f":"Tarifierung!A9","v":"verb. GT Ärzte"},{"$f":"VP1_UIVGT_VSu","v":0},{"$f":"Tarifierung!C9","v":0},{"$f":"Tarifierung!B10","v":474000},{"$f":"Tarifierung!C10","v":5.89},{"$f":"Tarifierung!B11","v":200},{"$f":"Tarifierung!C11","v":3.95},{"$f":"Tarifierung!B12","v":0},{"$f":"Tarifierung!C12","v":0},{"$f":"Tarifierung!A13","v":"TG ab 8. Tag"},{"$f":"Tarifierung!B13","v":0},{"$f":"Tarifierung!C13","v":0},{"$f":"Tarifierung!B14","v":0},{"$f":"Tarifierung!C14","v":0},{"$f":"Tarifierung!B15","v":50000},{"$f":"Tarifierung!C15","v":0},{"$f":"Tarifierung!B16","v":50000},{"$f":"Tarifierung!C16","v":0},{"$f":"Tarifierung!A17","v":"UIR"},{"$f":"Tarifierung!B17","v":0},{"$f":"Tarifierung!C17","v":0},{"$f":"Tarifierung!A18","v":"URP"},{"$f":"Tarifierung!B18","v":0},{"$f":"Tarifierung!C18","v":0},{"$f":"VP1_KiMo","v":"nein"},{"$f":"VP1_KiMo_BS","v":0},{"$f":"VP1_KöMo","v":"nein"},{"$f":"Tarifierung!B21","v":"nein"},{"$f":"Tarifierung!C21","v":0},{"$f":"Tarifierung!B22","v":"Premium"},{"$f":"Tarifierung!C22","v":1.4319999999999999},{"$f":"Tarifierung!B24","v":0.2},{"$f":"IF(Tarifierung!B25=0,1,5)","v":5},{"$f":"Tarifierung!B29","v":11549.806799999998},{"$f":"Tarifierung!B30","v":5948.15},{"$f":"Tarifierung!B31","v":3031.82},{"$f":"Tarifierung!B32","v":1029.8599999999999}]

{"sheet":"Maklertarif","index":6,"n_rows":94,"n_cols":21,"rows_kept":94,"cut":false,"hidden":true,"merged":[[26,17,26,18],[26,19,26,20],[26,1,26,7],[26,8,26,14]]}
[null,null,null,null,null,null,null,null,"Nachlass",0.05]
[null,"Gefahrengruppe A, B, K für Einzelunfall"]
[null,"Leistungsarten Erwachsene Kinder",null,"A","B","K","S"]
["Progression","ohne","je 1.000 ",{"$f":"ROUND(Tarifgruppen!D3*(1-Maklertarif!$J$1),3)","v":0.627},{"$f":"ROUND(Tarifgruppen!E3*(1-Maklertarif!$J$1),3)","v":0.88400000000000001},{"$f":"ROUND(Tarifgruppen!I3*(1-Maklertarif!$J$1),3)","v":0.30399999999999999}]
["Progression",3.5,"je 1.000 ",{"$f":"ROUND(Tarifgruppen!D4*(1-Maklertarif!$J$1),3)","v":0.88400000000000001},{"$f":"ROUND(Tarifgruppen!E4*(1-Maklertarif!$J$1),3)","v":1.2729999999999999},{"$f":"ROUND(Tarifgruppen!I4*(1-Maklertarif!$J$1),3)","v":0.39900000000000002}]
["Progression",6,"je 1.000 ",{"$f":"ROUND(Tarifgruppen!D5*(1-Maklertarif!$J$1),3)","v":1.093},{"$f":"ROUND(Tarifgruppen!E5*(1-Maklertarif!$J$1),3)","v":1.587},{"$f":"ROUND(Tarifgruppen!I5*(1-Maklertarif!$J$1),3)","v":0.44700000000000001}]
[null,"mit verbesserter Gliedertaxe für Ärzte UIVGT","je 1.000 ",{"$f":"ROUND(Tarifgruppen!D6*(1-Maklertarif!$J$1),3)","v":1.292}]
[null,"mit verbesserter Gliedertaxe für Ärzte mit UIVGP 350%","je 1.000 ",{"$f":"ROUND(Tarifgruppen!D7*(1-Maklertarif!$J$1),3)","v":2.774}]
[null,"Invaliditätsrente 0 – 59 Jahre UIR 65","je 10 ",{"$f":"ROUND(Tarifgruppen!D8*(1-Maklertarif!$J$1),3)","v":0.41799999999999998},{"$f":"ROUND(Tarifgruppen!E8*(1-Maklertarif!$J$1),3)","v":0.77900000000000003},{"$f":"ROUND(Tarifgruppen!I8*(1-Maklertarif!$J$1),3)","v":0.29499999999999998}]
[null,"Invaliditätsrente 0 – 59 Jahre UIR (ein Leben lang)","je 10 ",{"$f":"ROUND(Tarifgruppen!D9*(1-Maklertarif!$J$1),3)","v":0.751},{"$f":"ROUND(Tarifgruppen!E9*(1-Maklertarif!$J$1),3)","v":1.226},{"$f":"ROUND(Tarifgruppen!I9*(1-Maklertarif!$J$1),3)","v":0.34200000000000003},{"$f":"ROUND(Tarifgruppen!J9*(1-Maklertarif!$J$1),3)","v":0}]
[null,null,null,{"$f":"ROUND(Tarifgruppen!D10*(1-Maklertarif!$J$1),3)","v":0},{"$f":"ROUND(Tarifgruppen!E10*(1-Maklertarif!$J$1),3)","v":0},{"$f":"ROUND(Tarifgruppen!I10*(1-Maklertarif!$J$1),3)","v":0},{"$f":"ROUND(Tarifgruppen!J10*(1-Maklertarif!$J$1),3)","v":0}]
[null,"Tod UT","je 1.000 ",{"$f":"ROUND(Tarifgruppen!D11*(1-Maklertarif!$J$1),3)","v":0.49399999999999999},{"$f":"ROUND(Tarifgruppen!E11*(1-Maklertarif!$J$1),3)","v":0.627},{"$f":"ROUND(Tarifgruppen!J11*(1-Maklertarif!$J$1),3)","v":0.32300000000000001}]
[null,"Unfallkrankenhaustagegeld UKT","je 1",{"$f":"ROUND(Tarifgruppen!D12*(1-Maklertarif!$J$1),3)","v":0.33300000000000002},{"$f":"ROUND(Tarifgruppen!E12*(1-Maklertarif!$J$1),3)","v":0.437},{"$f":"ROUND(Tarifgruppen!J12*(1-Maklertarif!$J$1),3)","v":0.2}]
[null,"Genesungsgeld GG ","je 1",{"$f":"ROUND(Tarifgruppen!D13*(1-Maklertarif!$J$1),3)","v":0.32300000000000001},{"$f":"ROUND(Tarifgruppen!E13*(1-Maklertarif!$J$1),3)","v":0.42799999999999999},{"$f":"ROUND(Tarifgruppen!J13*(1-Maklertarif!$J$1),3)","v":0.19}]
["Tagegeld","ab 8. Tag","je 1",{"$f":"ROUND(Tarifgruppen!D14*(1-Maklertarif!$J$1),3)","v":4.2370000000000001},{"$f":"ROUND(Tarifgruppen!E14*(1-Maklertarif!$J$1),3)","v":6.593}]
{"$rows_left_out":80}
{"sheet":"V-Tarif","index":7,"n_rows":94,"n_cols":21,"rows_kept":94,"cut":false,"hidden":true,"merged":[[26,17,26,18],[26,19,26,20],[26,1,26,7],[26,8,26,14]]}
[null,null,null,null,null,null,null,null,"Nachlass",0.5]
[null,"Gefahrengruppe A, B, K für Einzelunfall"]
[null,"Leistungsarten Erwachsene Kinder",null,"A","B","K","S"]
["Progression","ohne","je 1.000 ",{"$f":"ROUND(Tarifgruppen!D3*(1-'V-Tarif'!$J$1),2)","v":0.33},{"$f":"ROUND(Tarifgruppen!E3*(1-'V-Tarif'!$J$1),2)","v":0.47},{"$f":"ROUND(Tarifgruppen!I3*(1-'V-Tarif'!$J$1),2)","v":0.16}]
["Progression",3.5,"je 1.000 ",{"$f":"ROUND(Tarifgruppen!D4*(1-'V-Tarif'!$J$1),2)","v":0.47},{"$f":"ROUND(Tarifgruppen!E4*(1-'V-Tarif'!$J$1),2)","v":0.67},{"$f":"ROUND(Tarifgruppen!I4*(1-'V-Tarif'!$J$1),2)","v":0.21}]
["Progression",6,"je 1.000 ",{"$f":"ROUND(Tarifgruppen!D5*(1-'V-Tarif'!$J$1),2)","v":0.57999999999999996},{"$f":"ROUND(Tarifgruppen!E5*(1-'V-Tarif'!$J$1),2)","v":0.84},{"$f":"ROUND(Tarifgruppen!I5*(1-'V-Tarif'!$J$1),2)","v":0.24}]
[null,"mit verbesserter Gliedertaxe für Ärzte UIVGT","je 1.000 ",{"$f":"ROUND(Tarifgruppen!D6*(1-'V-Tarif'!$J$1),2)","v":0.68}]
[null,"mit verbesserter Gliedertaxe für Ärzte mit UIVGP 350%","je 1.000 ",{"$f":"ROUND(Tarifgruppen!D7*(1-'V-Tarif'!$J$1),2)","v":1.46}]
[null,"Invaliditätsrente 0 – 59 Jahre UIR 65","je 10 ",{"$f":"ROUND(Tarifgruppen!D8*(1-'V-Tarif'!$J$1),2)","v":0.22},{"$f":"ROUND(Tarifgruppen!E8*(1-'V-Tarif'!$J$1),2)","v":0.41},{"$f":"ROUND(Tarifgruppen!I8*(1-'V-Tarif'!$J$1),2)","v":0.16}]
[null,"Invaliditätsrente 0 – 59 Jahre UIR (ein Leben lang)","je 10 ",{"$f":"ROUND(Tarifgruppen!D9*(1-'V-Tarif'!$J$1),2)","v":0.4},{"$f":"ROUND(Tarifgruppen!E9*(1-'V-Tarif'!$J$1),2)","v":0.65},{"$f":"ROUND(Tarifgruppen!I9*(1-'V-Tarif'!$J$1),2)","v":0.18},{"$f":"ROUND(Tarifgruppen!J9*(1-'V-Tarif'!$J$1),2)","v":0}]
[null,null,null,{"$f":"ROUND(Tarifgruppen!D10*(1-'V-Tarif'!$J$1),2)","v":0},{"$f":"ROUND(Tarifgruppen!E10*(1-'V-Tarif'!$J$1),2)","v":0},{"$f":"ROUND(Tarifgruppen!I10*(1-'V-Tarif'!$J$1),2)","v":0},{"$f":"ROUND(Tarifgruppen!J10*(1-'V-Tarif'!$J$1),2)","v":0}]
[null,"Tod UT","je 1.000 ",{"$f":"ROUND(Tarifgruppen!D11*(1-'V-Tarif'!$J$1),2)","v":0.26},{"$f":"ROUND(Tarifgruppen!E11*(1-'V-Tarif'!$J$1),2)","v":0.33},{"$f":"ROUND(Tarifgruppen!J11*(1-'V-Tarif'!$J$1),2)","v":0.17}]
[null,"Unfallkrankenhaustagegeld UKT","je 1",{"$f":"ROUND(Tarifgruppen!D12*(1-'V-Tarif'!$J$1),2)","v":0.18},{"$f":"ROUND(Tarifgruppen!E12*(1-'V-Tarif'!$J$1),2)","v":0.23},{"$f":"ROUND(Tarifgruppen!J12*(1-'V-Tarif'!$J$1),2)","v":0.11}]
[null,"Genesungsgeld GG ","je 1",{"$f":"ROUND(Tarifgruppen!D13*(1-'V-Tarif'!$J$1),2)","v":0.17},{"$f":"ROUND(Tarifgruppen!E13*(1-'V-Tarif'!$J$1),2)","v":0.23},{"$f":"ROUND(Tarifgruppen!J13*(1-'V-Tarif'!$J$1),2)","v":0.1}]
["Tagegeld","ab 8. Tag","je 1",{"$f":"ROUND(Tarifgruppen!D14*(1-'V-Tarif'!$J$1),2)","v":2.23},{"$f":"ROUND(Tarifgruppen!E14*(1-'V-Tarif'!$J$1),2)","v":3.47}]
{"$rows_left_out":79}